BDBM50030770 CHEMBL3342362
SMILES FC(F)(F)Oc1ccc(CNc2nc(NCC3CC3)cc(n2)-c2ccccn2)cc1
InChI Key InChIKey=INMKYWPKBFAKSH-UHFFFAOYSA-N
Data  2 EC50
  Tab Delimited (TSV)   2D SDfile   Computed 3D by Vconf -m prep SDfile
Find this compound or compounds like it in BindingDB:
Activity Spreadsheet -- Enzyme Inhibition Constant Data from BindingDB
Found 2 hits for monomerid = 50030770
TargetG-protein coupled receptor 39(Homo sapiens (Human))
Novartis Institutes For Biomedical Research
Curated by ChEMBL
LigandPNGBDBM50030770(CHEMBL3342362)
Affinity DataEC50:  600nM. Assay description: Agonist activity at human GPR39 expressed in HEK293 cells by IP1 assay
In DepthDetails ArticlePubMed
TargetG-protein coupled receptor 39(Mus musculus)
Novartis Institutes For Biomedical Research
Curated by ChEMBL
LigandPNGBDBM50030770(CHEMBL3342362)
Affinity DataEC50:  22nM. Assay description: Agonist activity at mouse GPR39 expressed in HEK293 cells by IP1 assay
In DepthDetails ArticlePubMed