BDBM50030778 CHEMBL3342375
SMILES CNc1nc(NCc2ccc(cc2)S(C)(=O)=O)cc(n1)-c1ccccn1
InChI Key InChIKey=CGYLEMNSAPBBNF-UHFFFAOYSA-N
Data  2 EC50
  Tab Delimited (TSV)   2D SDfile   Computed 3D by Vconf -m prep SDfile
Find this compound or compounds like it in BindingDB:
Activity Spreadsheet -- Enzyme Inhibition Constant Data from BindingDB
Found 2 hits for monomerid = 50030778
TargetG-protein coupled receptor 39(Mus musculus)
Novartis Institutes For Biomedical Research
Curated by ChEMBL
LigandPNGBDBM50030778(CHEMBL3342375)
Affinity DataEC50:  185nM. Assay description: Agonist activity at mouse GPR39 expressed in HEK293 cells by IP1 assay
In DepthDetails ArticlePubMed
TargetG-protein coupled receptor 39(Homo sapiens (Human))
Novartis Institutes For Biomedical Research
Curated by ChEMBL
LigandPNGBDBM50030778(CHEMBL3342375)
Affinity DataEC50:  36nM. Assay description: Agonist activity at human GPR39 expressed in HEK293 cells by IP1 assay
In DepthDetails ArticlePubMed