BDBM50033002 (3-Amino-propyl)-(4-fluoro-benzyl)-phosphinic acid::CHEMBL323713
SMILES NCCCP(O)(=O)Cc1ccc(F)cc1
InChI Key InChIKey=MVAREGAKIBHVLF-UHFFFAOYSA-N
Data  1 IC50
  Tab Delimited (TSV)   2D SDfile   Computed 3D by Vconf -m prep SDfile
Find this compound or compounds like it in BindingDB:
Activity Spreadsheet -- Enzyme Inhibition Constant Data from BindingDB
Found 1 hit for monomerid = 50033002
TargetGamma-aminobutyric acid type B receptor subunit 1(Rattus norvegicus (Rat))
Ciba-Geigy
Curated by ChEMBL
LigandPNGBDBM50033002((3-Amino-propyl)-(4-fluoro-benzyl)-phosphinic acid...)
Affinity DataIC50:  5.20E+4nM. Assay description: Inhibition of binding of [3H]-CGP-27,492 to gamma-aminobutyric acid type B receptor of rat cortex.
In DepthDetails ArticlePubMed