BDBM50033218 1-Methyl-4-[4-(2-methyl-imidazo[4,5-c]pyridin-1-yl)-phenyl]-1,3-dihydro-benzo[b][1,4]diazepin-2-one::CHEMBL119847
SMILES CN1c2ccccc2N=C(CC1=O)c1ccc(cc1)-n1c(C)nc2cnccc12
InChI Key InChIKey=FWMSCMAWBURVDX-UHFFFAOYSA-N
Data  1 IC50
  Tab Delimited (TSV)   2D SDfile   Computed 3D by Vconf -m prep SDfile
Find this compound or compounds like it in BindingDB:
Activity Spreadsheet -- Enzyme Inhibition Constant Data from BindingDB
Found 1 hit for monomerid = 50033218
TargetPlatelet-activating factor receptor(Cavia porcellus)
Pfizer
Curated by ChEMBL
LigandPNGBDBM50033218(1-Methyl-4-[4-(2-methyl-imidazo[4,5-c]pyridin-1-yl...)
Affinity DataIC50:  4.90nM. Assay description: Antagonistic activity was tested against Platelet-Activating Factor-induced aggregation of rabbit washed platelets.
In DepthDetails ArticlePubMed