BDBM50037175 2-[5-(Benzyl-ethyl-amino)-pentyl]-isoindole-1,3-dione::CHEMBL110298
SMILES CCN(CCCCCN1C(=O)c2ccccc2C1=O)Cc1ccccc1
InChI Key InChIKey=ABYLWTIWGBIVQQ-UHFFFAOYSA-N
Data  1 IC50
  Tab Delimited (TSV)   2D SDfile   Computed 3D by Vconf -m prep SDfile
Find this compound or compounds like it in BindingDB:
Activity Spreadsheet -- Enzyme Inhibition Constant Data from BindingDB
Found 1 hit for monomerid = 50037175
TargetAcetylcholinesterase(Rattus norvegicus (rat))
Takeda Chemical Industries
Curated by ChEMBL
LigandPNGBDBM50037175(2-[5-(Benzyl-ethyl-amino)-pentyl]-isoindole-1,3-di...)
Affinity DataIC50:  3.37E+3nM. Assay description: Inhibition concentration against rat acetylcholinesterase
In DepthDetails ArticlePubMed