BDBM50038983 Benzo[1,3]dioxol-5-ylmethyl-quinazolin-4-yl-amine::CHEMBL66732
SMILES C(Nc1ncnc2ccccc12)c1ccc2OCOc2c1
InChI Key InChIKey=MLVNLAHRZDXSAM-UHFFFAOYSA-N
Data  1 IC50
  Tab Delimited (TSV)   2D SDfile   Computed 3D by Vconf -m prep SDfile
Find this compound or compounds like it in BindingDB:
Activity Spreadsheet -- Enzyme Inhibition Constant Data from BindingDB
Found 1 hit for monomerid = 50038983
TargetcGMP-specific 3',5'-cyclic phosphodiesterase(Homo sapiens (Human))
Eisai
Curated by ChEMBL
LigandPNGBDBM50038983(Benzo[1,3]dioxol-5-ylmethyl-quinazolin-4-yl-amine ...)
Affinity DataIC50:  4.20E+3nM. Assay description: Inhibitory activity against cGMP-phosphodiesterase from porcine aorta
In DepthDetails ArticlePubMed