BDBM50041968 Benzyl-{4-oxo-2-propyl-3-[2'-(2H-tetrazol-5-yl)-biphenyl-4-ylmethyl]-3,4-dihydro-quinazolin-6-yl}-carbamic acid propyl ester::CHEMBL322471
SMILES CCCOC(=O)N(Cc1ccccc1)c1ccc2nc(CCC)n(Cc3ccc(cc3)-c3ccccc3-c3nnn[nH]3)c(=O)c2c1
InChI Key InChIKey=ANCYVULDNZYYMG-UHFFFAOYSA-N
Data  2 IC50
  Tab Delimited (TSV)   2D SDfile   Computed 3D by Vconf -m prep SDfile
Find this compound or compounds like it in BindingDB:
Activity Spreadsheet -- Enzyme Inhibition Constant Data from BindingDB
Found 2 hits for monomerid = 50041968
TargetType-2 angiotensin II receptor(RAT)
Merck Research Laboratories
Curated by ChEMBL
LigandPNGBDBM50041968(Benzyl-{4-oxo-2-propyl-3-[2'-(2H-tetrazol-5-yl)-bi...)
Affinity DataIC50:  0.800nM. Assay description: Binding affinity against Angiotensin II receptor type 2 from rat mid brain using [125I]-Sar1-Ile8-Ang II without BSA
In DepthDetails ArticlePubMed
TargetType-1 angiotensin II receptor(RABBIT)
Merck Research Laboratories
Curated by ChEMBL
LigandPNGBDBM50041968(Benzyl-{4-oxo-2-propyl-3-[2'-(2H-tetrazol-5-yl)-bi...)
Affinity DataIC50:  2.5nM. Assay description: Binding affinity against AT-1 receptor from rabbit aorta using [125I]-Sar1-Ile8-Ang II without BSA
In DepthDetails ArticlePubMed