BDBM50049110 2-Propyl-1-[2'-(2H-tetrazol-5-yl)-biphenyl-4-ylmethyl]-1H-imidazole-4,5-dicarboxylic acid::CHEMBL441649
SMILES CCCc1nc(C(O)=O)c(C(O)=O)n1Cc1ccc(cc1)-c1ccccc1-c1nnn[nH]1
InChI Key InChIKey=GSUQFFAIQCAYST-UHFFFAOYSA-N
Data  1 IC50
  Tab Delimited (TSV)   2D SDfile   Computed 3D by Vconf -m prep SDfile
Find this compound or compounds like it in BindingDB:
Activity Spreadsheet -- Enzyme Inhibition Constant Data from BindingDB
Found 1 hit for monomerid = 50049110
TargetType-1 angiotensin II receptor(Bos taurus)
Sankyo
Curated by ChEMBL
LigandPNGBDBM50049110(2-Propyl-1-[2'-(2H-tetrazol-5-yl)-biphenyl-4-ylmet...)
Affinity DataIC50:  100nM. Assay description: In vitro for inhibition of [125I]-angiotensin II (0.1 nM) binding to angiotensin II receptor type 1 in membrane fractions of bovine adrenal cortex
In DepthDetails ArticlePubMed