BDBM50054356 2-{3-[4-(4-Nitro-phenyl)-piperazin-1-yl]-propyl}-tetrahydro-pyrrolo[1,2-c]imidazole-1,3-dione::CHEMBL46377
SMILES Oc1c2CCCn2c(=O)n1CCCN1CCN(CC1)c1ccc(cc1)[N+]([O-])=O
InChI Key InChIKey=ACFRJYPCQVVKOZ-UHFFFAOYSA-N
Data  3 KI
  Tab Delimited (TSV)   2D SDfile   Computed 3D by Vconf -m prep SDfile
Find this compound or compounds like it in BindingDB:
Activity Spreadsheet -- Enzyme Inhibition Constant Data from BindingDB
Found 3 hits for monomerid = 50054356
TargetD(2) dopamine receptor(Rattus norvegicus (rat))
Universidad Complutense
Curated by ChEMBL
LigandPNGBDBM50054356(2-{3-[4-(4-Nitro-phenyl)-piperazin-1-yl]-propyl}-t...)
Affinity DataKi: >1.00E+4nM. Assay description: Binding affinity towards dopamine receptor D2 using [3H]-raclopride radioligand.
In DepthDetails ArticlePubMed
Target5-hydroxytryptamine receptor 1A(Rattus norvegicus (rat))
Universidad Complutense
Curated by ChEMBL
LigandPNGBDBM50054356(2-{3-[4-(4-Nitro-phenyl)-piperazin-1-yl]-propyl}-t...)
Affinity DataKi: >1.00E+4nM. Assay description: Binding affinity towards rat 5-hydroxytryptamine 1A receptor using [3H]-8-OH-DPAT radioligand.
In DepthDetails ArticlePubMed
Target5-hydroxytryptamine receptor 1A(Rattus norvegicus (rat))
Universidad Complutense
Curated by ChEMBL
LigandPNGBDBM50054356(2-{3-[4-(4-Nitro-phenyl)-piperazin-1-yl]-propyl}-t...)
Affinity DataKi:  1.68E+5nM. Assay description: Tested in vitro for binding affinity by measuring its ability to inhibit [3H]8-OH-DPAT binding at 5-hydroxytryptamine 1A receptor in rat cerebral cor...
In DepthDetails ArticlePubMed