BDBM50055483 CHEMBL151310::Dimethyl-carbamic acid (E)-(1R,3S,5R,12S,13R,16S)-5,9,12,13-tetramethyl-2-oxo-4-oxa-tricyclo[10.3.1.0*3,5*]hexadec-8-en-16-ylmethyl ester
SMILES C[C@@H]1CC[C@@H]2[C@H](COC(=O)N(C)C)[C@@]1(C)CC\C(C)=C\CC[C@@]1(C)O[C@@H]1C2=O
InChI Key InChIKey=AAHCRDONHPHFSA-WAAYAITMSA-N
Data  1 IC50
  Tab Delimited (TSV)   2D SDfile   Computed 3D by Vconf -m prep SDfile
Find this compound or compounds like it in BindingDB:
Activity Spreadsheet -- Enzyme Inhibition Constant Data from BindingDB
Found 1 hit for monomerid = 50055483
TargetPlatelet-activating factor receptor(Cavia porcellus)
Sankyo
Curated by ChEMBL
LigandPNGBDBM50055483(CHEMBL151310 | Dimethyl-carbamic acid (E)-(1R,3S,5...)
Affinity DataIC50:  180nM. Assay description: Inhibiting Platelet activating factor receptor by radioreceptor binding assay using rabbit platelets and [3H]-PAF
In DepthDetails ArticlePubMed