BDBM50061206 CHEMBL124306::N-((R)-1-Methyl-2-oxo-5-phenyl-2,3-dihydro-1H-benzo[e][1,4]diazepin-3-yl)-2-phenyl-acetamide
SMILES CN1c2ccccc2C(=N[C@@H](NC(=O)Cc2ccccc2)C1=O)c1ccccc1
InChI Key InChIKey=GUWGGVBBJNORBJ-HSZRJFAPSA-N
Data  1 IC50
  Tab Delimited (TSV)   2D SDfile   Computed 3D by Vconf -m prep SDfile
Find this compound or compounds like it in BindingDB:
Activity Spreadsheet -- Enzyme Inhibition Constant Data from BindingDB
Found 1 hit for monomerid = 50061206
TargetGastrin/cholecystokinin type B receptor(Homo sapiens (Human))
Merck Research Laboratories
Curated by ChEMBL
LigandPNGBDBM50061206(CHEMBL124306 | N-((R)-1-Methyl-2-oxo-5-phenyl-2,3-...)
Affinity DataIC50: >1.00E+3nM. Assay description: Half maximal inhibition of binding of [125I]-CCK-8 to Cholecystokinin type B receptor in guinea pig cerebral cortex.
In DepthDetails ArticlePubMed