BDBM50070513 3-[2-(4-Phenyl-piperazin-1-yl)-ethyl]-2,3-dihydro-isoindol-1-one::CHEMBL34239
SMILES O=C1NC(CCN2CCN(CC2)c2ccccc2)c2ccccc12
InChI Key InChIKey=AIKAECUQHAATGN-UHFFFAOYSA-N
Data  2 KI
  Tab Delimited (TSV)   2D SDfile   Computed 3D by Vconf -m prep SDfile
Find this compound or compounds like it in BindingDB:
Activity Spreadsheet -- Enzyme Inhibition Constant Data from BindingDB
Found 2 hits for monomerid = 50070513
TargetD(4) dopamine receptor(Homo sapiens (Human))
Parke-Davis Pharmaceutical Research
Curated by ChEMBL
LigandPNGBDBM50070513(3-[2-(4-Phenyl-piperazin-1-yl)-ethyl]-2,3-dihydro-...)
Affinity DataKi:  25nM. Assay description: In vitro binding affinity at human dopamine D4 receptor expressed in CHO cells by [3H]spiperone displacement.
In DepthDetails ArticlePubMed
TargetD(3) dopamine receptor(Homo sapiens (Human))
Parke-Davis Pharmaceutical Research
Curated by ChEMBL
LigandPNGBDBM50070513(3-[2-(4-Phenyl-piperazin-1-yl)-ethyl]-2,3-dihydro-...)
Affinity DataKi:  2.68E+3nM. Assay description: Displacement of [3H]spiperone from human Dopamine receptor D3 expressed in CHO cells
In DepthDetails ArticlePubMed