BDBM50085691 CHEMBL350109::N-Benzyl-2-(4-benzylsulfamoyl-2-nitro-phenylamino)-thioacetamide
SMILES [O-][N+](=O)c1cc(ccc1NCC(=[SH+])[N-]Cc1ccccc1)S(=O)(=O)NCc1ccccc1
InChI Key InChIKey=NFEYYZXNIXMHGZ-UHFFFAOYSA-N
Data  1 KI
  Tab Delimited (TSV)   2D SDfile   Computed 3D by Vconf -m prep SDfile
Find this compound or compounds like it in BindingDB:
Activity Spreadsheet -- Enzyme Inhibition Constant Data from BindingDB
Found 1 hit for monomerid = 50085691
TargetB2 bradykinin receptor(RAT)
Novartis Institute For Medical Sciences
Curated by ChEMBL
LigandPNGBDBM50085691(CHEMBL350109 | N-Benzyl-2-(4-benzylsulfamoyl-2-nit...)
Affinity DataKi: >1.00E+5nM. Assay description: Inhibition of binding of [3H]-BK to rat bradykinin B2 receptor expressed in NG108-15 neuroblastoma-glioma hybrid cell membranes
In DepthDetails ArticlePubMed