BDBM50089059 CHEMBL16965::Naphthalene-1-sulfonic acid 3-[(4-amino-quinazolin-2-ylamino)-methyl]-benzylamide
SMILES Nc1nc(NCc2cccc(CNS(=O)(=O)c3cccc4ccccc34)c2)nc2ccccc12
InChI Key InChIKey=BROYSXPFKABMKX-UHFFFAOYSA-N
Data  1 IC50
  Tab Delimited (TSV)   2D SDfile   Computed 3D by Vconf -m prep SDfile
Find this compound or compounds like it in BindingDB:
Activity Spreadsheet -- Enzyme Inhibition Constant Data from BindingDB
Found 1 hit for monomerid = 50089059
TargetNeuropeptide Y receptor type 5(Homo sapiens (Human))
Novartis Pharma
Curated by ChEMBL
LigandPNGBDBM50089059(CHEMBL16965 | Naphthalene-1-sulfonic acid 3-[(4-am...)
Affinity DataIC50:  380nM. Assay description: Antagonistic activity against neuropeptide Y receptor type 5 subtype stably expressed in LM(tk-)cells
In DepthDetails ArticlePubMed