BDBM50089419 CHEMBL3578001
SMILES C[C@@H](O)[C@H](NC(O)=O)C(=O)N[C@@H](C)C(=O)N[C@@H](Cc1ccc(O)cc1)C(=O)N[C@H]1CSSC[C@H](NC(=O)[C@H](Cc2ccccc2)NC(=O)[C@H](CC(N)=O)NC(=O)[C@H](Cc2ccccc2)NC(=O)[C@H](Cc2ccccc2)NC(=O)[C@H](CCCNC(N)=N)NC1=O)C(=O)N[C@@H](Cc1ccc(O)cc1)C(=O)N[C@@H](C)C(=O)N[C@@H](CCCNC(N)=N)C(N)=O
InChI Key InChIKey=CADGUJRMKNUYDE-XQFOLYGRSA-N
Data  2 EC50
  Tab Delimited (TSV)   2D SDfile   Computed 3D by Vconf -m prep SDfile
Find this compound or compounds like it in BindingDB:
Activity Spreadsheet -- Enzyme Inhibition Constant Data from BindingDB
Found 2 hits for monomerid = 50089419
TargetMelanocyte-stimulating hormone receptor(Mus musculus)
University Of Minnesota
Curated by ChEMBL
LigandPNGBDBM50089419(CHEMBL3578001)
Affinity DataEC50:  5.10E+3nM. Assay description: Agonist activity at mouse MC1R expressed in HEK293 cells by cAMP functional bioassay
In DepthDetails ArticlePubMed
TargetMelanocortin receptor 5(Mus musculus (Mouse))
University Of Minnesota
Curated by ChEMBL
LigandPNGBDBM50089419(CHEMBL3578001)
Affinity DataEC50: >1.00E+8nM. Assay description: Agonist activity at mouse MC5R expressed in HEK293 cells by cAMP functional bioassay
In DepthDetails ArticlePubMed