BDBM50089898 (2S,7S)-2-Amino-bicyclo[3.2.0]heptane-2,7-dicarboxylic acid::2-Amino-bicyclo[3.2.0]heptane-2,7-dicarboxylic acid::CHEMBL313394
SMILES N[C@]1(CCC2C[C@@H](C12)C(O)=O)C(O)=O
InChI Key InChIKey=DGIPVQKXSOJANP-GRVJPOFSSA-N
Data  5 KI
  Tab Delimited (TSV)   2D SDfile   Computed 3D by Vconf -m prep SDfile
Find this compound or compounds like it in BindingDB:
Activity Spreadsheet -- Enzyme Inhibition Constant Data from BindingDB
Found 5 hits for monomerid = 50089898
TargetMetabotropic glutamate receptor 2(Homo sapiens (Human))
The Royal Danish School Of Pharmacy
Curated by ChEMBL
LigandPNGBDBM50089898((2S,7S)-2-Amino-bicyclo[3.2.0]heptane-2,7-dicarbox...)
Affinity DataKi: >1.00E+6nM. Assay description: Agonist potency against cloned Metabotropic glutamate receptor 2 (mGluR-2).
In DepthDetails ArticlePubMed
TargetMetabotropic glutamate receptor 1(Homo sapiens (Human))
The Royal Danish School Of Pharmacy
Curated by ChEMBL
LigandPNGBDBM50089898((2S,7S)-2-Amino-bicyclo[3.2.0]heptane-2,7-dicarbox...)
Affinity DataKi: >1.00E+6nM. Assay description: Agonist potency against cloned human metabotropic glutamate receptor 1
In DepthDetails ArticlePubMed
TargetMetabotropic glutamate receptor 5(Homo sapiens (Human))
The Royal Danish School Of Pharmacy
Curated by ChEMBL
LigandPNGBDBM50089898((2S,7S)-2-Amino-bicyclo[3.2.0]heptane-2,7-dicarbox...)
Affinity DataKi: >1.00E+6nM. Assay description: Agonist potency against cloned metabotropic glutamate receptor 5
In DepthDetails ArticlePubMed
TargetMetabotropic glutamate receptor 6(Homo sapiens (Human))
The Royal Danish School Of Pharmacy
Curated by ChEMBL
LigandPNGBDBM50089898((2S,7S)-2-Amino-bicyclo[3.2.0]heptane-2,7-dicarbox...)
Affinity DataKi: >1.00E+6nM. Assay description: Agonist potency against cloned Metabotropic glutamate receptor 6 (mGluR-6).
In DepthDetails ArticlePubMed
TargetMetabotropic glutamate receptor 4(Homo sapiens (Human))
The Royal Danish School Of Pharmacy
Curated by ChEMBL
LigandPNGBDBM50089898((2S,7S)-2-Amino-bicyclo[3.2.0]heptane-2,7-dicarbox...)
Affinity DataKi: >1.00E+6nM. Assay description: Agonist potency against cloned human Metabotropic glutamate receptor 4 (mGluR-4)
In DepthDetails ArticlePubMed