BDBM50092743 CHEMBL3586329
SMILES COc1cc(cc2CN(Cc3cccnc3)CCOc12)-c1ccccc1C
InChI Key InChIKey=BIBFQQHLGWITIP-IEBWSBKVSA-N
Data  2 IC50
  Tab Delimited (TSV)   2D SDfile   Computed 3D by Vconf -m prep SDfile
Find this compound or compounds like it in BindingDB:
Activity Spreadsheet -- Enzyme Inhibition Constant Data from BindingDB
Found 2 hits for monomerid = 50092743
TargetProstaglandin E2 receptor EP2 subtype(Homo sapiens (Human))
Amgen
Curated by ChEMBL
LigandPNGBDBM50092743(CHEMBL3586329)
Affinity DataIC50: >3.00E+4nM. Assay description: Displacement of [3H]-PGE2 from human EP2 receptor overexpressed in human ECV304 cell membranes by scintillation proximity assay
In DepthDetails ArticlePubMed
TargetProstaglandin E2 receptor EP2 subtype(Homo sapiens (Human))
Amgen
Curated by ChEMBL
LigandPNGBDBM50092743(CHEMBL3586329)
Affinity DataIC50: >3.00E+4nM. Assay description: Antagonist activity at human EP2 receptor overexpressed in human ECV304 cells assessed as inhibition of prostaglandin E2-induced cAMP production
In DepthDetails ArticlePubMed