BDBM50093530 7-(3-Bromo-propoxy)-3-(4-hydroxy-phenyl)-chromen-4-one::CHEMBL115314
SMILES Oc1ccc(cc1)-c1coc2cc(OCCCBr)ccc2c1=O
InChI Key InChIKey=JMDIKMSOYUTVEL-UHFFFAOYSA-N
Data  2 IC50
  Tab Delimited (TSV)   2D SDfile   Computed 3D by Vconf -m prep SDfile
Find this compound or compounds like it in BindingDB:
Activity Spreadsheet -- Enzyme Inhibition Constant Data from BindingDB
Found 2 hits for monomerid = 50093530
TargetAldehyde dehydrogenase, mitochondrial(Homo sapiens (Human))
Harvard Medical School
Curated by ChEMBL
LigandPNGBDBM50093530(7-(3-Bromo-propoxy)-3-(4-hydroxy-phenyl)-chromen-4...)
Affinity DataIC50:  260nM. Assay description: Inhibition of hamster liver aldehyde dehydrogenase ALDH-2
In DepthDetails ArticlePubMed
TargetAldehyde dehydrogenase, mitochondrial(Homo sapiens (Human))
Harvard Medical School
Curated by ChEMBL
LigandPNGBDBM50093530(7-(3-Bromo-propoxy)-3-(4-hydroxy-phenyl)-chromen-4...)
Affinity DataIC50:  260nM. Assay description: Inhibition of Hamster Liver mitochondrial ALDH-2
In DepthDetails ArticlePubMed