BDBM50101199 2-(3,5-Dimethyl-phenyl)-3-[2-(4-pyridin-4-yl-butylamino)-ethyl]-1H-indole-5-carboxylic acid dimethylamide::CHEMBL295591
SMILES CN(C)C(=O)c1ccc2[nH]c(c(CCNCCCCc3ccncc3)c2c1)-c1cc(C)cc(C)c1
InChI Key InChIKey=KIHQLDLWIZBSCP-UHFFFAOYSA-N
Data  2 IC50
  Tab Delimited (TSV)   2D SDfile   Computed 3D by Vconf -m prep SDfile
Find this compound or compounds like it in BindingDB:
Activity Spreadsheet -- Enzyme Inhibition Constant Data from BindingDB
Found 2 hits for monomerid = 50101199
TargetGonadotropin-releasing hormone receptor(Rattus norvegicus)
Merck Research Laboratories
Curated by ChEMBL
LigandPNGBDBM50101199(2-(3,5-Dimethyl-phenyl)-3-[2-(4-pyridin-4-yl-butyl...)
Affinity DataIC50:  0.800nM. Assay description: Inhibition of GnRH-stimulated phosphatidyinositol (PI) hydrolysis in cloned chinese hamster ovary (CHO) cells expressing human GnRH receptor.
In DepthDetails ArticlePubMed
TargetGonadotropin-releasing hormone receptor(Rattus norvegicus)
Merck Research Laboratories
Curated by ChEMBL
LigandPNGBDBM50101199(2-(3,5-Dimethyl-phenyl)-3-[2-(4-pyridin-4-yl-butyl...)
Affinity DataIC50:  1.46E+3nM. Assay description: Inhibition of GnRH-stimulated luteinizing hormone (LH) release in rat pituitary cells
In DepthDetails ArticlePubMed