BDBM50101957 (4-Chloro-3-nitro-phenyl)-phenyl-methanone::CHEMBL53270
SMILES [O-][N+](=O)c1cc(ccc1Cl)C(=O)c1ccccc1
InChI Key InChIKey=YBDBYPQFIMSFJW-UHFFFAOYSA-N
Data  1 IC50
  Tab Delimited (TSV)   2D SDfile   Computed 3D by Vconf -m prep SDfile
Find this compound or compounds like it in BindingDB:
Activity Spreadsheet -- Enzyme Inhibition Constant Data from BindingDB
Found 1 hit for monomerid = 50101957
TargetVascular cell adhesion protein 1(Homo sapiens (Human))
Atherogenics
Curated by ChEMBL
LigandPNGBDBM50101957((4-Chloro-3-nitro-phenyl)-phenyl-methanone | CHEMB...)
Affinity DataIC50:  1.50E+4nM. Assay description: Ability to inhibit expression of Vascular cell adhesion molecule 1
In DepthDetails ArticlePubMed