BDBM50105031 4-tert-Butyl-N-[6-(2-hydroxy-ethoxy)-5-p-tolyl-pyrimidin-4-yl]-benzenesulfonamide::CHEMBL324304
SMILES Cc1ccc(cc1)-c1c(NS(=O)(=O)c2ccc(cc2)C(C)(C)C)ncnc1OCCO
InChI Key InChIKey=ALQRUULAVXAWSN-UHFFFAOYSA-N
Data  3 IC50
  Tab Delimited (TSV)   2D SDfile   Computed 3D by Vconf -m prep SDfile
Find this compound or compounds like it in BindingDB:
Activity Spreadsheet -- Enzyme Inhibition Constant Data from BindingDB
Found 3 hits for monomerid = 50105031
TargetEndothelin-1 receptor(Sus scrofa)
Tanabe Seiyaku
Curated by ChEMBL
LigandPNGBDBM50105031(4-tert-Butyl-N-[6-(2-hydroxy-ethoxy)-5-p-tolyl-pyr...)
Affinity DataIC50: >100nM. Assay description: In vitro inhibition of [125I]-ET-1 binding to Endothelin A receptor in porcine aortic membrane from endothelial cells
In DepthDetails ArticlePubMed
TargetEndothelin-1 receptor(Homo sapiens (Human))
Actelion Pharmaceuticals
Curated by ChEMBL
LigandPNGBDBM50105031(4-tert-Butyl-N-[6-(2-hydroxy-ethoxy)-5-p-tolyl-pyr...)
Affinity DataIC50:  1.00E+3nM. Assay description: Displacement of 125I-ET1 from human placenta cell membrane ETA receptor expressed in Baculovirus-infected insect cells
In DepthDetails ArticlePubMed
TargetEndothelin-1 receptor(Homo sapiens (Human))
Actelion Pharmaceuticals
Curated by ChEMBL
LigandPNGBDBM50105031(4-tert-Butyl-N-[6-(2-hydroxy-ethoxy)-5-p-tolyl-pyr...)
Affinity DataIC50:  1.00E+3nM. Assay description: Displacement of 125I-ET1 from human placenta cell membrane ETA receptor expressed in Baculovirus-infected insect cells
In DepthDetails ArticlePubMed