BDBM50107553 CHEMBL136871::N-{6-[2-(5-Bromo-pyrimidin-2-yloxy)-ethoxy]-2-thiophen-2-yl-5-p-tolyl-pyrimidin-4-yl}-4-tert-butyl-benzenesulfonamide
SMILES Cc1ccc(cc1)-c1c(NS(=O)(=O)c2ccc(cc2)C(C)(C)C)nc(nc1OCCOc1ncc(Br)cn1)-c1cccs1
InChI Key InChIKey=GOFLEZZSYRHWQC-UHFFFAOYSA-N
Data  1 IC50
  Tab Delimited (TSV)   2D SDfile   Computed 3D by Vconf -m prep SDfile
Find this compound or compounds like it in BindingDB:
Activity Spreadsheet -- Enzyme Inhibition Constant Data from BindingDB
Found 1 hit for monomerid = 50107553
TargetEndothelin-1 receptor(Sus scrofa)
Tanabe Seiyaku
Curated by ChEMBL
LigandPNGBDBM50107553(CHEMBL136871 | N-{6-[2-(5-Bromo-pyrimidin-2-yloxy)...)
Affinity DataIC50:  3.90nM. Assay description: In vitro inhibition of [125 I]ET-1 binding to Endothelin A receptor in porcine aortic membrane.
In DepthDetails ArticlePubMed