BDBM50108423 Benzyl-(3-methoxy-benzyl)-dimethyl-ammonium; bromide::CHEMBL293268
SMILES COc1cccc(C[N+](C)(C)Cc2ccccc2)c1
InChI Key InChIKey=WZXIGBHYDVBXDB-UHFFFAOYSA-N
Data  1 IC50
  Tab Delimited (TSV)   2D SDfile   Computed 3D by Vconf -m prep SDfile
Find this compound or compounds like it in BindingDB:
Activity Spreadsheet -- Enzyme Inhibition Constant Data from BindingDB
Found 1 hit for monomerid = 50108423
TargetAcetylcholinesterase(Homo sapiens (Human))
Organon Laboratories
Curated by ChEMBL
LigandPNGBDBM50108423(Benzyl-(3-methoxy-benzyl)-dimethyl-ammonium; bromi...)
Affinity DataIC50: >1.00E+4nM. Assay description: In vitro inhibitory activity against human recombinant AChE
In DepthDetails ArticlePubMed