BDBM50117919 CHEMBL3612470
SMILES CC(=O)NC[C@@H]1CCc2ccccc2N1Cc1ccccc1
InChI Key InChIKey=CGEJOVUHOJQGJO-SFHVURJKSA-N
Data  1 KI
  Tab Delimited (TSV)   2D SDfile   Computed 3D by Vconf -m prep SDfile
Find this compound or compounds like it in BindingDB:
Activity Spreadsheet -- Enzyme Inhibition Constant Data from BindingDB
Found 1 hit for monomerid = 50117919
TargetMelatonin receptor type 1A(Homo sapiens (Human))
Universit£
Curated by ChEMBL
LigandPNGBDBM50117919(CHEMBL3612470)
Affinity DataKi:  122nM. Assay description: Displacement of 2-[125I]-Iodomelatonin from human MT1 receptor transfected in CHO cell membranes after 120 mins
In DepthDetails ArticlePubMed