BDBM50118153 (Cyclohexyl-phenyl-methyl)-carbamic acid 3-(1H-imidazol-4-yl)-propyl ester;C2H2O4::CHEMBL131476
SMILES O=C(NC(C1CCCCC1)c1ccccc1)OCCCc1cnc[nH]1
InChI Key InChIKey=HRBGUFPRCCRUJW-UHFFFAOYSA-N
Data  1 KI  2 Kd
  Tab Delimited (TSV)   2D SDfile   Computed 3D by Vconf -m prep SDfile
Find this compound or compounds like it in BindingDB:
Activity Spreadsheet -- Enzyme Inhibition Constant Data from BindingDB
Found 3 hits for monomerid = 50118153
TargetHistamine H3 receptor(Rattus norvegicus (rat))
Freie Universit£T Berlin
Curated by ChEMBL
LigandPNGBDBM50118153((Cyclohexyl-phenyl-methyl)-carbamic acid 3-(1H-imi...)
Affinity DataKi:  56nM. Assay description: In vitro Histamine H3 receptor antagonist activity in synaptosomes of rat cerebral cortex
In DepthDetails ArticlePubMed
TargetHistamine H3 receptor(GUINEA PIG)
Freie Universit£T Berlin
Curated by ChEMBL
LigandPNGBDBM50118153((Cyclohexyl-phenyl-methyl)-carbamic acid 3-(1H-imi...)
Affinity DataKd:  100nM. Assay description: Receptor profile was evaluated at Histamine H3 receptor of guinea pig ileum
In DepthDetails ArticlePubMed
TargetHistamine H1 receptor(Cavia porcellus (domestic guinea pig))
Freie Universit£T Berlin
Curated by ChEMBL
LigandPNGBDBM50118153((Cyclohexyl-phenyl-methyl)-carbamic acid 3-(1H-imi...)
Affinity DataKd:  7.94E+3nM. Assay description: Receptor profile was evaluated at Histamine H1 receptor of guinea pig ileum
In DepthDetails ArticlePubMed