BDBM50118170 CHEMBL3613661
SMILES COc1nn(Cc2ccc(NC(=O)c3ccccc3)cc2)c(=O)o1
InChI Key InChIKey=RNMXDOINOBDDHI-UHFFFAOYSA-N
Data  4 IC50
  Tab Delimited (TSV)   2D SDfile   Computed 3D by Vconf -m prep SDfile
Find this compound or compounds like it in BindingDB:
Activity Spreadsheet -- Enzyme Inhibition Constant Data from BindingDB
Found 4 hits for monomerid = 50118170
TargetMonoglyceride lipase(Homo sapiens (Human))
University Of Eastern Finland
Curated by ChEMBL
LigandPNGBDBM50118170(CHEMBL3613661)
Affinity DataIC50:  560nM. Assay description: Inhibition of human MAGL expressed in HEK293 cells pre-incubated for 10 mins before 2-AG substrate addition by HPLC method
In DepthDetails ArticlePubMed
TargetFatty-acid amide hydrolase 1(Homo sapiens (Human))
University Of Eastern Finland
Curated by ChEMBL
LigandPNGBDBM50118170(CHEMBL3613661)
Affinity DataIC50:  617nM. Assay description: Inhibition of human FAAH expressed in COS7 cell membranes pre-incubated for 10 mins before [3H]-AEA substrate addition by liquid scintillation counti...
In DepthDetails ArticlePubMed
TargetFatty-acid amide hydrolase 1(Homo sapiens (Human))
University Of Eastern Finland
Curated by ChEMBL
LigandPNGBDBM50118170(CHEMBL3613661)
Affinity DataIC50:  620nM. Assay description: Inhibition of human FAAH expressed in COS7 cell membranes pre-incubated for 10 mins before [3H]-AEA substrate addition by liquid scintillation counti...
In DepthDetails ArticlePubMed
TargetMonoglyceride lipase(Homo sapiens (Human))
University Of Eastern Finland
Curated by ChEMBL
LigandPNGBDBM50118170(CHEMBL3613661)
Affinity DataIC50:  562nM. Assay description: Inhibition of human MAGL expressed in HEK293 cells pre-incubated for 10 mins before 2-AG substrate addition by HPLC method
In DepthDetails ArticlePubMed