BDBM50120632 CHEMBL3618328
SMILES COc1cc(ccc1OCC(O)C1CC1)-n1cnn2nc(cc2c1=O)-c1ccc(Cl)cc1
InChI Key InChIKey=DXLNSICNAKMOOX-UHFFFAOYSA-N
Data  2 KI
  Tab Delimited (TSV)   2D SDfile   Computed 3D by Vconf -m prep SDfile
Find this compound or compounds like it in BindingDB:
Activity Spreadsheet -- Enzyme Inhibition Constant Data from BindingDB
Found 2 hits for monomerid = 50120632
TargetMelanin-concentrating hormone receptor 1(Homo sapiens (Human))
Bristol-Myers Squibb Research And Development
Curated by ChEMBL
LigandPNGBDBM50120632(CHEMBL3618328)
Affinity DataKi:  13nM. Assay description: Displacement of [125I][Phe13,Tyr19]-MCH from human MCHR1 expressed in HEK293 cells by scintillation counting analysis
In DepthDetails ArticlePubMed
TargetMelanin-concentrating hormone receptor 1(RAT)
Bristol-Myers Squibb Research And Development
Curated by ChEMBL
LigandPNGBDBM50120632(CHEMBL3618328)
Affinity DataKi:  13nM. Assay description: Displacement of [125I][Phe13,Tyr19]-MCH from rat MCHR1 by scintillation counting analysis
In DepthDetails ArticlePubMed