BDBM50122733 1-Propyl-3-o-tolyl-piperidine; hydrochloride::CHEMBL553258
SMILES CCCN1CCCC(C1)c1ccccc1C
InChI Key InChIKey=DSPOQGRZNACTQF-UHFFFAOYSA-N
Data  4 KI
  Tab Delimited (TSV)   2D SDfile   Computed 3D by Vconf -m prep SDfile
Find this compound or compounds like it in BindingDB:
Activity Spreadsheet -- Enzyme Inhibition Constant Data from BindingDB
Found 4 hits for monomerid = 50122733
TargetD(2) dopamine receptor(BOVINE)
Universit£
Curated by ChEMBL
LigandPNGBDBM50122733(1-Propyl-3-o-tolyl-piperidine; hydrochloride | CHE...)
Affinity DataKi:  449nM. Assay description: Affinity for Dopamine receptor D2 using [3H]YM-09151-2 was carried out on bovine retinal membrane preparations (high-affinity)
In DepthDetails ArticlePubMed
TargetD(2) dopamine receptor(BOVINE)
Universit£
Curated by ChEMBL
LigandPNGBDBM50122733(1-Propyl-3-o-tolyl-piperidine; hydrochloride | CHE...)
Affinity DataKi:  1.51E+3nM. Assay description: Affinity for Dopamine receptor D2 using [3H]-YM-09151-2 was carried out on bovine striatal membrane preparations
In DepthDetails ArticlePubMed
TargetD(1A) dopamine receptor(BOVINE)
Universit£
Curated by ChEMBL
LigandPNGBDBM50122733(1-Propyl-3-o-tolyl-piperidine; hydrochloride | CHE...)
Affinity DataKi: >1.00E+4nM. Assay description: Affinity for Dopamine receptor D1 using [3H]SCH-23390 was carried out on bovine retinal membrane preparations
In DepthDetails ArticlePubMed
TargetD(2) dopamine receptor(BOVINE)
Universit£
Curated by ChEMBL
LigandPNGBDBM50122733(1-Propyl-3-o-tolyl-piperidine; hydrochloride | CHE...)
Affinity DataKi:  2.67E+4nM. Assay description: Affinity for Dopamine receptor D2 using [3H]YM-09151-2 was carried out on bovine retinal membrane preparations (low-affinity)
In DepthDetails ArticlePubMed