BDBM50124154 CHEMBL3622827
SMILES NCCn1c(nc2cc(ccc12)C(N)=O)C1CCCCC1
InChI Key InChIKey=PTYYLKYBWXHUAG-UHFFFAOYSA-N
Data  4 IC50
  Tab Delimited (TSV)   2D SDfile   Computed 3D by Vconf -m prep SDfile
Find this compound or compounds like it in BindingDB:
Activity Spreadsheet -- Enzyme Inhibition Constant Data from BindingDB
Found 4 hits for monomerid = 50124154
TargetTyrosine-protein kinase JAK1(Homo sapiens (Human))
Konkuk University
Curated by ChEMBL
LigandPNGBDBM50124154(CHEMBL3622827)
Affinity DataIC50:  4.30E+3nM. Assay description: Inhibition of JAK1 (unknown origin) using 87 uM of ATP and Tyr6 peptide by Z'-LYTE kinase assay
In DepthDetails ArticlePubMed
TargetNon-receptor tyrosine-protein kinase TYK2(Homo sapiens (Human))
Konkuk University
Curated by ChEMBL
LigandPNGBDBM50124154(CHEMBL3622827)
Affinity DataIC50:  3.30E+3nM. Assay description: Inhibition of Tyk2 (unknown origin) using 25 uM of ATP and Tyr3 peptide by Z'-LYTE kinase assay
In DepthDetails ArticlePubMed
TargetTyrosine-protein kinase JAK3(Homo sapiens (Human))
Konkuk University
Curated by ChEMBL
LigandPNGBDBM50124154(CHEMBL3622827)
Affinity DataIC50:  2.50E+3nM. Assay description: Inhibition of JAK3 (unknown origin) using 16 uM of ATP and Tyr6 peptide by Z'-LYTE kinase assay
In DepthDetails ArticlePubMed
TargetTyrosine-protein kinase JAK2(Homo sapiens (Human))
Konkuk University
Curated by ChEMBL
LigandPNGBDBM50124154(CHEMBL3622827)
Affinity DataIC50:  4.10E+3nM. Assay description: Inhibition of JAK2 (unknown origin) using 35 uM of ATP and Tyr6 peptide by Z'-LYTE kinase assay
In DepthDetails ArticlePubMed