BDBM50126064 (S)-1-((S)-3-Chloro-phenyl)-2-[2-(1H-indol-3-yl)-1-methyl-ethylamino]-ethanol::CHEMBL282039
SMILES C[C@@H](Cc1c[nH]c2ccccc12)NC[C@@H](O)c1cccc(Cl)c1
InChI Key InChIKey=AGWBMRMDTWHPJM-ORAYPTAESA-N
Data  3 EC50
  Tab Delimited (TSV)   2D SDfile   Computed 3D by Vconf -m prep SDfile
Find this compound or compounds like it in BindingDB:
Activity Spreadsheet -- Enzyme Inhibition Constant Data from BindingDB
Found 3 hits for monomerid = 50126064
TargetBeta-3 adrenergic receptor(Homo sapiens (Human))
Dainippon Pharmaceutical
Curated by ChEMBL
LigandPNGBDBM50126064((S)-1-((S)-3-Chloro-phenyl)-2-[2-(1H-indol-3-yl)-1...)
Affinity DataEC50:  3.30E+3nM. Assay description: Agonism of recombinant human beta-3 adrenergic receptor assayed by measuring cAMP accumulation in CHO cells expressing beta3-AR
In DepthDetails ArticlePubMed
TargetBeta-3 adrenergic receptor(Homo sapiens (Human))
Dainippon Pharmaceutical
Curated by ChEMBL
LigandPNGBDBM50126064((S)-1-((S)-3-Chloro-phenyl)-2-[2-(1H-indol-3-yl)-1...)
Affinity DataEC50:  33nM. Assay description: Agonistic activity against human Beta-3 adrenergic receptor as cAMP accumulation in CHO cells expressing beta3-AR
In DepthDetails ArticlePubMed
TargetBeta-1 adrenergic receptor(Homo sapiens (Human))
Dainippon Pharmaceutical
Curated by ChEMBL
LigandPNGBDBM50126064((S)-1-((S)-3-Chloro-phenyl)-2-[2-(1H-indol-3-yl)-1...)
Affinity DataEC50:  140nM. Assay description: Agonistic activity against human Beta-1 adrenergic receptor by measuring cAMP accumulation in CHO cells expressing beta3-AR
In DepthDetails ArticlePubMed