BDBM50126258 2-[5-(6-Chloro-pyridine-3-carbonyl)-1-methyl-1H-pyrrol-2-yl]-N-[2,4-dimethyl-3-(2-methyl-quinolin-8-yloxymethyl)-phenyl]-N-methyl-acetamide::CHEMBL286710
SMILES CN(C(=O)Cc1ccc(C(=O)c2ccc(Cl)nc2)n1C)c1ccc(C)c(COc2cccc3ccc(C)nc23)c1C
InChI Key InChIKey=ANVSGCMMXYFPIH-UHFFFAOYSA-N
Data  1 KI
  Tab Delimited (TSV)   2D SDfile   Computed 3D by Vconf -m prep SDfile
Find this compound or compounds like it in BindingDB:
Activity Spreadsheet -- Enzyme Inhibition Constant Data from BindingDB
Found 1 hit for monomerid = 50126258
TargetB2 bradykinin receptor(Homo sapiens (Human))
Johnson & Johnson Pharmaceutical Research And Development
Curated by ChEMBL
LigandPNGBDBM50126258(2-[5-(6-Chloro-pyridine-3-carbonyl)-1-methyl-1H-py...)
Affinity DataKi:  271nM. Assay description: Binding affinity towards human bradykinin receptor B2
In DepthDetails ArticlePubMed