BDBM50130428 CHEMBL322018::N-(3-Piperidin-4-yl-1H-pyrrolo[3,2-b]pyridin-5-yl)-acetamide
SMILES CC(=O)Nc1ccc2[nH]cc(C3CCNCC3)c2n1
InChI Key InChIKey=LXZJUOMETYSHFR-UHFFFAOYSA-N
Data  1 KI
  Tab Delimited (TSV)   2D SDfile   Computed 3D by Vconf -m prep SDfile
Find this compound or compounds like it in BindingDB:
Activity Spreadsheet -- Enzyme Inhibition Constant Data from BindingDB
Found 1 hit for monomerid = 50130428
Target5-hydroxytryptamine receptor 1F(Homo sapiens (Human))
Eli Lilly
Curated by ChEMBL
LigandPNGBDBM50130428(CHEMBL322018 | N-(3-Piperidin-4-yl-1H-pyrrolo[3,2-...)
Affinity DataKi:  45nM. Assay description: In vitro binding affinity was determined by radioligand binding assay using cell line expressing human 5-hydroxytryptamine 1F receptor
In DepthDetails ArticlePubMed