BDBM50131895 CHEMBL3633896
SMILES C[C@@H](NC(=O)CNC(=O)c1cccc(Cl)c1)c1ccccc1
InChI Key InChIKey=MWDVCHRYCKXEBY-GFCCVEGCSA-N
Data  1 EC50
  Tab Delimited (TSV)   2D SDfile   Computed 3D by Vconf -m prep SDfile
Find this compound or compounds like it in BindingDB:
Activity Spreadsheet -- Enzyme Inhibition Constant Data from BindingDB
Found 1 hit for monomerid = 50131895
TargetProbable G-protein coupled receptor 139(Homo sapiens (Human))
Janssen Research And Development
Curated by ChEMBL
LigandPNGBDBM50131895(CHEMBL3633896)
Affinity DataEC50:  2.10E+3nM. Assay description: Binding affinity against delta opioid receptor in mouse hot plate test
In DepthDetails ArticlePubMed