BDBM50131921 CHEMBL340641::Isoquinoline-3-carboxylic acid {4-[4-(2,4-dichloro-phenyl)-piperazin-1-yl]-butyl}-amide
SMILES Clc1ccc(N2CCN(CCCCNC(=O)c3cc4ccccc4cn3)CC2)c(Cl)c1
InChI Key InChIKey=BJILZOKLMRTDFN-UHFFFAOYSA-N
Data  6 KI
  Tab Delimited (TSV)   2D SDfile   Computed 3D by Vconf -m prep SDfile
Find this compound or compounds like it in BindingDB:
Activity Spreadsheet -- Enzyme Inhibition Constant Data from BindingDB
Found 6 hits for monomerid = 50131921
TargetD(3) dopamine receptor(Rattus norvegicus (Rat))
Universit£
Curated by ChEMBL
LigandPNGBDBM50131921(CHEMBL340641 | Isoquinoline-3-carboxylic acid {4-[...)
Affinity DataKi:  0.660nM. Assay description: Binding affinity for rat striatum Dopamine receptor D3 (sf9 cells) by [3H]7-OH-DPAT displacement.
In DepthDetails ArticlePubMed
TargetD(2) dopamine receptor(Rattus norvegicus (rat))
Universit£
Curated by ChEMBL
LigandPNGBDBM50131921(CHEMBL340641 | Isoquinoline-3-carboxylic acid {4-[...)
Affinity DataKi:  342nM. Assay description: Binding affinity for rat striatum Dopamine receptor D2 by [3H]spiperone displacement.
In DepthDetails ArticlePubMed
TargetAlpha-1A adrenergic receptor(Rattus norvegicus (Rat))
Universit£
Curated by ChEMBL
LigandPNGBDBM50131921(CHEMBL340641 | Isoquinoline-3-carboxylic acid {4-[...)
Affinity DataKi:  629nM. Assay description: Binding affinity for rat cortex alpha-1 adrenergic receptor by inhibition of [3H]prazosin binding
In DepthDetails ArticlePubMed
TargetAlpha-2A adrenergic receptor [16-465](Rattus norvegicus (rat))
Universit£
Curated by ChEMBL
LigandPNGBDBM50131921(CHEMBL340641 | Isoquinoline-3-carboxylic acid {4-[...)
Affinity DataKi:  1.05E+3nM. Assay description: Binding affinity for rat cortex Alpha-2 adrenergic receptor was determined using [3H]-RX 81002 binding
In DepthDetails ArticlePubMed
Target5-hydroxytryptamine receptor 1A(Rattus norvegicus (rat))
Universit£
Curated by ChEMBL
LigandPNGBDBM50131921(CHEMBL340641 | Isoquinoline-3-carboxylic acid {4-[...)
Affinity DataKi:  1.05E+3nM. Assay description: Binding affinity for rat hippocampus 5-hydroxytryptamine 1A receptor by inhibition of [3H]8-OH-DPAT binding
In DepthDetails ArticlePubMed
TargetD(1A) dopamine receptor(RAT)
Universit£
Curated by ChEMBL
LigandPNGBDBM50131921(CHEMBL340641 | Isoquinoline-3-carboxylic acid {4-[...)
Affinity DataKi:  7.75E+3nM. Assay description: Binding affinity for rat striatum dopamine Dopamine receptor D1 by [3H]-SCH- -2339 displacement.
In DepthDetails ArticlePubMed