BDBM50132697 1-Methoxy-4-phenylethynyl-naphthalene-2-carboxylic acid ((R)-1-benzyl-pyrrolidin-3-yl)-amide::CHEMBL109472
SMILES COc1c(cc(C#Cc2ccccc2)c2ccccc12)C(=O)N[C@@H]1CCN(Cc2ccccc2)C1
InChI Key InChIKey=DAUORZLLBDGUDH-AREMUKBSSA-N
Data  10 KI
  Tab Delimited (TSV)   2D SDfile   Computed 3D by Vconf -m prep SDfile
Find this compound or compounds like it in BindingDB:
Activity Spreadsheet -- Enzyme Inhibition Constant Data from BindingDB
Found 10 hits for monomerid = 50132697
TargetD(4) dopamine receptor(Homo sapiens (Human))
Friedrich-Alexander University
Curated by ChEMBL
LigandPNGBDBM50132697(1-Methoxy-4-phenylethynyl-naphthalene-2-carboxylic...)
Affinity DataKi:  500nM. Assay description: Ability to displace [3H]-spiperone [0.5 nM (Kd=0.1-0.45 nM)] from human recombinant dopamine receptor D4 expressed in CHO cells
In DepthDetails ArticlePubMed
TargetD(4) dopamine receptor(Homo sapiens (Human))
Friedrich-Alexander University
Curated by ChEMBL
LigandPNGBDBM50132697(1-Methoxy-4-phenylethynyl-naphthalene-2-carboxylic...)
Affinity DataKi:  500nM. Assay description: Displacement of [3H]-spiperone [0.5 nM (Kd=0.1 nM)] from human recombinant dopamine receptor D2L expressed in CHO cells
In DepthDetails ArticlePubMed
TargetD(3) dopamine receptor(Homo sapiens (Human))
Friedrich-Alexander University
Curated by ChEMBL
LigandPNGBDBM50132697(1-Methoxy-4-phenylethynyl-naphthalene-2-carboxylic...)
Affinity DataKi:  1.00E+3nM. Assay description: Displacement of [3H]-spiperone [0.5 nM (Kd=0.1 nM)] from recombinant human dopamine receptor D3 expressed in CHO cells at 0.5 nM concentration
In DepthDetails ArticlePubMed
TargetD(3) dopamine receptor(Homo sapiens (Human))
Friedrich-Alexander University
Curated by ChEMBL
LigandPNGBDBM50132697(1-Methoxy-4-phenylethynyl-naphthalene-2-carboxylic...)
Affinity DataKi:  1.00E+3nM. Assay description: Ability to displace [3H]-spiperone [0.5 nM (Kd=0.1-0.45 nM)] from human recombinant dopamine receptor D4 expressed in CHO cells
In DepthDetails ArticlePubMed
TargetD(1A) dopamine receptor(BOVINE)
Friedrich-Alexander University
Curated by ChEMBL
LigandPNGBDBM50132697(1-Methoxy-4-phenylethynyl-naphthalene-2-carboxylic...)
Affinity DataKi:  2.80E+3nM. Assay description: Displacement of [3H]-spiperone [0.5 nM (Kd=0.1 nM)] from recombinant human dopamine receptor D3 expressed in CHO cells at 0.5 nM concentration
In DepthDetails ArticlePubMed
TargetD(1A) dopamine receptor(BOVINE)
Friedrich-Alexander University
Curated by ChEMBL
LigandPNGBDBM50132697(1-Methoxy-4-phenylethynyl-naphthalene-2-carboxylic...)
Affinity DataKi:  2.80E+3nM. Assay description: Displacement of [3H]-SCH-23,390 [0.3 nM (Kd=0.35 nM)] from dopamine receptor D1 in bovine striatal membranes
In DepthDetails ArticlePubMed
TargetD(2) dopamine receptor(Homo sapiens (Human))
Friedrich-Alexander University
Curated by ChEMBL
LigandPNGBDBM50132697(1-Methoxy-4-phenylethynyl-naphthalene-2-carboxylic...)
Affinity DataKi:  4.00E+3nM. Assay description: Displacement of [3H]-spiperone [0.5 nM (Kd=0.1 nM)] from human recombinant dopamine receptor D2L expressed in CHO cells
In DepthDetails ArticlePubMed
TargetD(2) dopamine receptor(Homo sapiens (Human))
Friedrich-Alexander University
Curated by ChEMBL
LigandPNGBDBM50132697(1-Methoxy-4-phenylethynyl-naphthalene-2-carboxylic...)
Affinity DataKi:  4.00E+3nM. Assay description: Displacement of [3H]-spiperone [0.5 nM (Kd=0.2-0.45 nM)] from human recombinant dopamine receptor D2S expressed in CHO cells at 0.5 nM concentration
In DepthDetails ArticlePubMed
TargetD(2) dopamine receptor(Homo sapiens (Human))
Friedrich-Alexander University
Curated by ChEMBL
LigandPNGBDBM50132697(1-Methoxy-4-phenylethynyl-naphthalene-2-carboxylic...)
Affinity DataKi:  6.40E+3nM. Assay description: Displacement of [3H]-spiperone [0.5 nM (Kd=0.1 nM)] from human recombinant dopamine receptor D2L expressed in CHO cells
In DepthDetails ArticlePubMed
TargetD(2) dopamine receptor(Homo sapiens (Human))
Friedrich-Alexander University
Curated by ChEMBL
LigandPNGBDBM50132697(1-Methoxy-4-phenylethynyl-naphthalene-2-carboxylic...)
Affinity DataKi:  6.40E+3nM. Assay description: Ability to displace [3H]-spiperone [0.5 nM (Kd=0.1-0.45 nM)] from human recombinant dopamine receptor D4 expressed in CHO cells
In DepthDetails ArticlePubMed