BDBM50134197 CHEMBL3735493
SMILES Cc1ccoc1CNc1nc(Oc2cc(Cl)cc(Cl)c2)nc2ccc(F)cc12
InChI Key InChIKey=HSAKQXYAGZRRNI-UHFFFAOYSA-N
Data  1 IC50
  Tab Delimited (TSV)   2D SDfile   Computed 3D by Vconf -m prep SDfile
Find this compound or compounds like it in BindingDB:
Activity Spreadsheet -- Enzyme Inhibition Constant Data from BindingDB
Found 1 hit for monomerid = 50134197
TargetProteinase-activated receptor 2(Homo sapiens (Human))
Yonsei University
Curated by ChEMBL
LigandPNGBDBM50134197(CHEMBL3735493)
Affinity DataIC50:  2.80E+3nM. Assay description: Antagonist activity at protease-activated receptor 2 (unknown origin) expressed in CHO-K1 cells assessed as inhibition of trypsin-induced calcium flu...
In DepthDetails ArticlePubMed