BDBM50135422 Biphenyl-2-carboxylic acid {4-[2-(2,2-difluoro-ethyl)-3,4-dihydro-2H-benzo[b][1,4]thiazepine-5-carbonyl]-phenyl}-amide::CHEMBL334363
SMILES FC(F)CC1CCN(C(=O)c2ccc(NC(=O)c3ccccc3-c3ccccc3)cc2)c2ccccc2S1
InChI Key InChIKey=CSMQABFHHCZJMM-UHFFFAOYSA-N
Data  2 IC50
  Tab Delimited (TSV)   2D SDfile   Computed 3D by Vconf -m prep SDfile
Find this compound or compounds like it in BindingDB:
Activity Spreadsheet -- Enzyme Inhibition Constant Data from BindingDB
Found 2 hits for monomerid = 50135422
TargetVasopressin V2 receptor(Homo sapiens (Human))
Johnson & Johnson Pharmaceutical Research & Development
Curated by ChEMBL
LigandPNGBDBM50135422(Biphenyl-2-carboxylic acid {4-[2-(2,2-difluoro-eth...)
Affinity DataIC50:  100nM. Assay description: Ability to displace [3H]-arginine vasopressin in cloned human V2 receptor
In DepthDetails ArticlePubMed
TargetVasopressin V1a receptor(Homo sapiens (Human))
Johnson & Johnson Pharmaceutical Research & Development
Curated by ChEMBL
LigandPNGBDBM50135422(Biphenyl-2-carboxylic acid {4-[2-(2,2-difluoro-eth...)
Affinity DataIC50:  160nM. Assay description: Ability of the compound to displace [3H]-arginine vasopressin in cloned human V1a receptor
In DepthDetails ArticlePubMed