BDBM50136804 CHEMBL439077::Somatostatin analogue
SMILES C[C@H](O)[C@@H]1NC(=O)[C@H](CCCCN)NC(=O)[C@H](Cc2c[nH]c3ccccc23)NC(=O)[C@H](Cc2ccc(N)cc2)NC(=O)[C@@H](Cc2ccccc2)NC(=O)[C@@H](CSSC[C@H](NC(=O)[C@H](Cc2ccccc2)NC1=O)C(O)=O)NC(=O)[C@H](N)Cc1ccc(O)cc1
InChI Key InChIKey=CGKCQZCBEXFSFW-NHHOLAQASA-N
Data  5 IC50
  Tab Delimited (TSV)   2D SDfile   Computed 3D by Vconf -m prep SDfile
Find this compound or compounds like it in BindingDB:
Activity Spreadsheet -- Enzyme Inhibition Constant Data from BindingDB
Found 5 hits for monomerid = 50136804
TargetSomatostatin receptor type 4(Homo sapiens (Human))
Salk Institute
Curated by ChEMBL
LigandPNGBDBM50136804(CHEMBL439077 | Somatostatin analogue)
Affinity DataIC50:  1.20nM. Assay description: Binding affinity towards human somatostatin receptor type 4 using [125I]-[Leu8,DTrp22,Tyr25]SRIF-28 as radioligand.
In DepthDetails ArticlePubMed
TargetSomatostatin receptor type 5(Homo sapiens (Human))
Salk Institute
Curated by ChEMBL
LigandPNGBDBM50136804(CHEMBL439077 | Somatostatin analogue)
Affinity DataIC50:  34nM. Assay description: Binding affinity towards human somatostatin receptor type 5 using [125I]-[Leu8,DTrp22,Tyr25]SRIF-28 as radioligand.
In DepthDetails ArticlePubMed
TargetSomatostatin receptor type 2(Homo sapiens (Human))
Salk Institute
Curated by ChEMBL
LigandPNGBDBM50136804(CHEMBL439077 | Somatostatin analogue)
Affinity DataIC50:  56nM. Assay description: Binding affinity towards human somatostatin receptor type 2 using [125I]-[Leu8,DTrp22,Tyr25]SRIF-28 as radioligand.
In DepthDetails ArticlePubMed
TargetSomatostatin receptor type 1(Homo sapiens (Human))
Salk Institute
Curated by ChEMBL
LigandPNGBDBM50136804(CHEMBL439077 | Somatostatin analogue)
Affinity DataIC50:  517nM. Assay description: Binding affinity towards human somatostatin receptor type 1 using [125I]-[Leu8,DTrp22,Tyr25]SRIF-28 as radioligand.
In DepthDetails ArticlePubMed
TargetSomatostatin receptor type 3(Homo sapiens (Human))
Salk Institute
Curated by ChEMBL
LigandPNGBDBM50136804(CHEMBL439077 | Somatostatin analogue)
Affinity DataIC50:  263nM. Assay description: Binding affinity towards human somatostatin receptor type 3 using [125I]-[Leu8,DTrp22,Tyr25]SRIF-28 as radioligand.
In DepthDetails ArticlePubMed