BDBM50138257 CHEMBL3752110
SMILES C[C@H]1CC=C(C(O)=O)[C@@](C)(C1)c1ccccc1
InChI Key InChIKey=ANOXFEIPVZKIKE-NHYWBVRUSA-N
Data  1 IC50
  Tab Delimited (TSV)   2D SDfile   Computed 3D by Vconf -m prep SDfile
Find this compound or compounds like it in BindingDB:
Activity Spreadsheet -- Enzyme Inhibition Constant Data from BindingDB
Found 1 hit for monomerid = 50138257
TargetC-C chemokine receptor type 2(Homo sapiens (Human))
Bristol-Myers Squibb
Curated by ChEMBL
LigandPNGBDBM50138257(CHEMBL3752110)
Affinity DataIC50:  9.74E+3nM. Assay description: Displacement of [125I]MCP-1 from CCR2 in human PBMC by radioligand displacement assay
In DepthDetails ArticlePubMed