BDBM50138339 5-Chloro-1-(4-methoxy-benzyl)-1H-indole-2-carboxylic acid::CHEMBL133168
SMILES COc1ccc(Cn2c(cc3cc(Cl)ccc23)C(O)=O)cc1
InChI Key InChIKey=APLJFWYNARKWQQ-UHFFFAOYSA-N
Data  1 IC50
  Tab Delimited (TSV)   2D SDfile   Computed 3D by Vconf -m prep SDfile
Find this compound or compounds like it in BindingDB:
Activity Spreadsheet -- Enzyme Inhibition Constant Data from BindingDB
Found 1 hit for monomerid = 50138339
TargetC-C chemokine receptor type 2(Homo sapiens (Human))
Astrazeneca
Curated by ChEMBL
LigandPNGBDBM50138339(5-Chloro-1-(4-methoxy-benzyl)-1H-indole-2-carboxyl...)
Affinity DataIC50:  5.77E+3nM. Assay description: Inhibition of human C-C chemokine receptor type 2
In DepthDetails ArticlePubMed