BDBM50140543 3-((S)-2-Benzyloxycarbonylamino-3-methyl-butyrylamino)-5-fluoro-4-oxo-pentanoic acid::CHEMBL23226::Z-Val-Asp-fmk
SMILES CC(C)[C@H](NC(=O)OCc1ccccc1)C(=O)NC(CC(O)=O)C(=O)CF
InChI Key InChIKey=LYBWGROBJJXCJJ-VYIIXAMBSA-N
Data  11 IC50
  Tab Delimited (TSV)   2D SDfile   Computed 3D by Vconf -m prep SDfile
Find this compound or compounds like it in BindingDB:
Activity Spreadsheet -- Enzyme Inhibition Constant Data from BindingDB
Found 11 hits for monomerid = 50140543
TargetCaspase-3(Homo sapiens (Human))
Maxim Pharmaceuticals
Curated by ChEMBL
LigandPNGBDBM50140543(3-((S)-2-Benzyloxycarbonylamino-3-methyl-butyrylam...)
Affinity DataIC50:  30nM. Assay description: Inhibitory activity against human recombinant caspase-3
In DepthDetails ArticlePubMed
TargetCaspase-8(Homo sapiens (Human))
Maxim Pharmaceuticals
Curated by ChEMBL
LigandPNGBDBM50140543(3-((S)-2-Benzyloxycarbonylamino-3-methyl-butyrylam...)
Affinity DataIC50:  7nM. Assay description: Compound was evaluated for its inhibitory activity against the Caspase-8 enzyme
In DepthDetails ArticlePubMed
TargetCalpain-1 catalytic subunit(Homo sapiens (Human))
Maxim Pharmaceuticals
Curated by ChEMBL
LigandPNGBDBM50140543(3-((S)-2-Benzyloxycarbonylamino-3-methyl-butyrylam...)
Affinity DataIC50: >1.00E+4nM. Assay description: Compound was evaluated for its inhibitory activity against the Calpain 1 enzyme
In DepthDetails ArticlePubMed
TargetCoagulation factor X(Homo sapiens (Human))
Maxim Pharmaceuticals
Curated by ChEMBL
LigandPNGBDBM50140543(3-((S)-2-Benzyloxycarbonylamino-3-methyl-butyrylam...)
Affinity DataIC50: >1.00E+5nM. Assay description: Compound was evaluated for its inhibitory activity against the Coagulation factor X
In DepthDetails ArticlePubMed
TargetCaspase-3(Homo sapiens (Human))
Maxim Pharmaceuticals
Curated by ChEMBL
LigandPNGBDBM50140543(3-((S)-2-Benzyloxycarbonylamino-3-methyl-butyrylam...)
Affinity DataIC50:  30nM. Assay description: Inhibitory activity against human recombinant Caspase-3 enzyme
In DepthDetails ArticlePubMed
TargetCathepsin B(Homo sapiens (Human))
Maxim Pharmaceuticals
Curated by ChEMBL
LigandPNGBDBM50140543(3-((S)-2-Benzyloxycarbonylamino-3-methyl-butyrylam...)
Affinity DataIC50: >1.00E+4nM. Assay description: Compound was evaluated for its inhibitory activity against Cathepsin B
In DepthDetails ArticlePubMed
TargetCaspase-7(Homo sapiens (Human))
Maxim Pharmaceuticals
Curated by ChEMBL
LigandPNGBDBM50140543(3-((S)-2-Benzyloxycarbonylamino-3-methyl-butyrylam...)
Affinity DataIC50:  7nM. Assay description: Compound was evaluated for its inhibitory activity against the Caspase-7 enzyme
In DepthDetails ArticlePubMed
TargetCaspase-9(Homo sapiens (Human))
Maxim Pharmaceuticals
Curated by ChEMBL
LigandPNGBDBM50140543(3-((S)-2-Benzyloxycarbonylamino-3-methyl-butyrylam...)
Affinity DataIC50:  5nM. Assay description: Compound was evaluated for its inhibitory activity against the Caspase-9 enzyme
In DepthDetails ArticlePubMed
TargetCaspase-1(Homo sapiens (Human))
Maxim Pharmaceuticals
Curated by ChEMBL
LigandPNGBDBM50140543(3-((S)-2-Benzyloxycarbonylamino-3-methyl-butyrylam...)
Affinity DataIC50:  20nM. Assay description: Compound was evaluated for its inhibitory activity against the Caspase-1 enzyme
In DepthDetails ArticlePubMed
TargetProthrombin(Homo sapiens (Human))
Maxim Pharmaceuticals
Curated by ChEMBL
LigandPNGBDBM50140543(3-((S)-2-Benzyloxycarbonylamino-3-methyl-butyrylam...)
Affinity DataIC50: >1.00E+5nM. Assay description: Compound was evaluated for its inhibitory activity against the Thrombin
In DepthDetails ArticlePubMed
TargetCaspase-6(Homo sapiens (Human))
Maxim Pharmaceuticals
Curated by ChEMBL
LigandPNGBDBM50140543(3-((S)-2-Benzyloxycarbonylamino-3-methyl-butyrylam...)
Affinity DataIC50:  18nM. Assay description: Compound was evaluated for its inhibitory activity against the Caspase-6 enzyme
In DepthDetails ArticlePubMed