BDBM50142411 2-[(2R,5R)-5-{[(Biphenyl-3-ylmethyl)-carbamoyl]-methyl}-2-(2,4-dichloro-phenyl)-4-oxo-thiazolidin-3-yl]-N-(3-morpholin-4-yl-propyl)-acetamide::CHEMBL42044
SMILES Clc1ccc([C@H]2S[C@H](CC(=O)NCc3cccc(c3)-c3ccccc3)C(=O)N2CC(=O)NCCCN2CCOCC2)c(Cl)c1
InChI Key InChIKey=DAJVHWOALRPGOB-CYTLCNBWSA-N
Data  1 IC50
  Tab Delimited (TSV)   2D SDfile   Computed 3D by Vconf -m prep SDfile
Find this compound or compounds like it in BindingDB:
Activity Spreadsheet -- Enzyme Inhibition Constant Data from BindingDB
Found 1 hit for monomerid = 50142411
TargetC-C chemokine receptor type 4(Homo sapiens (Human))
Array Biopharma
Curated by ChEMBL
LigandPNGBDBM50142411(2-[(2R,5R)-5-{[(Biphenyl-3-ylmethyl)-carbamoyl]-me...)
Affinity DataIC50:  1.30E+3nM. Assay description: Inhibition of [125I]-MDC binding to recombinant human C-C chemokine receptor type 4 (CCR4) expressed in murine pre-B cells
In DepthDetails ArticlePubMed