BDBM50142666 (S)-1-Heptyl-4-methyl-3-(3',4',5'-trimethoxy-biphenyl-4-ylmethyl)-piperazine-2,5-dione::CHEMBL298686
SMILES CCCCCCCN1CC(=O)N(C)[C@@H](Cc2ccc(cc2)-c2cc(OC)c(OC)c(OC)c2)C1=O
InChI Key InChIKey=JYQNEDUZLOVXTD-QHCPKHFHSA-N
Data  1 EC50
  Tab Delimited (TSV)   2D SDfile   Computed 3D by Vconf -m prep SDfile
Find this compound or compounds like it in BindingDB:
Activity Spreadsheet -- Enzyme Inhibition Constant Data from BindingDB
Found 1 hit for monomerid = 50142666
TargetFollicle-stimulating hormone receptor(Homo sapiens (Human))
Pharmacopeia
Curated by ChEMBL
LigandPNGBDBM50142666((S)-1-Heptyl-4-methyl-3-(3',4',5'-trimethoxy-biphe...)
Affinity DataEC50:  2.30E+3nM. Assay description: Agonistic activity against human follicle stimulating hormone receptor in CHO-hFSHR-luciferase assay.
In DepthDetails ArticlePubMed