BDBM50142757 CHEMBL3758368
SMILES COc1ccccc1N1CCN(CCCCCOc2ccc3ccccc3c2)CC1
InChI Key InChIKey=ATMVGYLFYGIYDI-UHFFFAOYSA-N
Data  3 KI
  Tab Delimited (TSV)   2D SDfile   Computed 3D by Vconf -m prep SDfile
Find this compound or compounds like it in BindingDB:
Activity Spreadsheet -- Enzyme Inhibition Constant Data from BindingDB
Found 3 hits for monomerid = 50142757
TargetAlpha-1A adrenergic receptor(Homo sapiens (Human))
Bioprojet-Biotech
Curated by ChEMBL
LigandPNGBDBM50142757(CHEMBL3758368)
Affinity DataKi:  10nM. Assay description: Displacement of [3H]-prazosin from human ADRA1A receptor
In DepthDetails ArticlePubMed
TargetD(2) dopamine receptor(Homo sapiens (Human))
Bioprojet-Biotech
Curated by ChEMBL
LigandPNGBDBM50142757(CHEMBL3758368)
Affinity DataKi:  34nM. Assay description: Displacement of [3H]-spiperone from human dopamine D2S receptor expressed in HEK293 cell membranes
In DepthDetails ArticlePubMed
TargetD(3) dopamine receptor(Homo sapiens (Human))
Bioprojet-Biotech
Curated by ChEMBL
LigandPNGBDBM50142757(CHEMBL3758368)
Affinity DataKi:  87nM. Assay description: Displacement of [3H]-spiperone from human dopamine D3 receptor expressed in CHO cell membranes
In DepthDetails ArticlePubMed