BDBM50142977 CHEMBL443519::Piperidine-2-carboxylic acid tert-butyl-[2-(8-carbamoylmethyl-6,9-dioxo-2-oxa-7,10-diaza-bicyclo[11.2.2]heptadeca-1(16),13(17),14-trien-11-yl)-2-hydroxy-ethyl]-amide
SMILES CC(C)(C)N(CC(O)C1Cc2ccc(OCCCC(=O)NC(CC(N)=O)C(=O)N1)cc2)C(=O)C1CCCCN1
InChI Key InChIKey=MUQGEOQOYLOCJI-UHFFFAOYSA-N
Data  1 KI
  Tab Delimited (TSV)   2D SDfile   Computed 3D by Vconf -m prep SDfile
Find this compound or compounds like it in BindingDB:
Activity Spreadsheet -- Enzyme Inhibition Constant Data from BindingDB
Found 1 hit for monomerid = 50142977
TargetGag-Pol polyprotein [489-587](Human immunodeficiency virus type 1)
The University Of Queensland
Curated by ChEMBL
LigandPNGBDBM50142977(CHEMBL443519 | Piperidine-2-carboxylic acid tert-b...)
Affinity DataKi:  12nM. Assay description: Tested for inhibition of synthetic HIV-1 protease by using fluorometric assay
In DepthDetails ArticlePubMed