BDBM50143663 9-Acetyl-3-{2-[4-(2-methoxy-phenyl)-piperazin-1-yl]-ethyl}-3,9-diaza-spiro[5.5]undecane-2,4-dione::CHEMBL57097
SMILES COc1ccccc1N1CCN(CCN2C(=O)CC3(CCN(CC3)C(C)=O)CC2=O)CC1
InChI Key InChIKey=YKHNMLLSJVJESN-UHFFFAOYSA-N
Data  4 KI
  Tab Delimited (TSV)   2D SDfile   Computed 3D by Vconf -m prep SDfile
Find this compound or compounds like it in BindingDB:
Activity Spreadsheet -- Enzyme Inhibition Constant Data from BindingDB
Found 4 hits for monomerid = 50143663
Target5-hydroxytryptamine receptor 1A(Homo sapiens (Human))
Recordati
Curated by ChEMBL
LigandPNGBDBM50143663(9-Acetyl-3-{2-[4-(2-methoxy-phenyl)-piperazin-1-yl...)
Affinity DataKi: >10nM. Assay description: Binding affinity to human 5-hydroxytryptamine 1A receptor was measured using [3H]-8-hydroxy-2-(di-n-propylamine) tetraline [3H]-8-OH-DPAT) as radioli...
In DepthDetails ArticlePubMed
TargetAlpha-1D adrenergic receptor(Rattus norvegicus (Rat))
Recordati
Curated by ChEMBL
LigandPNGBDBM50143663(9-Acetyl-3-{2-[4-(2-methoxy-phenyl)-piperazin-1-yl...)
Affinity DataKi:  429nM. Assay description: Binding affinity to the adrenergic receptor alpha-1D of rat aorta
In DepthDetails ArticlePubMed
TargetAlpha-1B adrenergic receptor(Homo sapiens (Human))
Recordati
Curated by ChEMBL
LigandPNGBDBM50143663(9-Acetyl-3-{2-[4-(2-methoxy-phenyl)-piperazin-1-yl...)
Affinity DataKi: >1.00E+3nM. Assay description: Binding affinity constant against alpha-1B adrenergic receptor of guinea pig spleen
In DepthDetails ArticlePubMed
TargetAlpha-1A adrenergic receptor(Rattus norvegicus (Rat))
Recordati
Curated by ChEMBL
LigandPNGBDBM50143663(9-Acetyl-3-{2-[4-(2-methoxy-phenyl)-piperazin-1-yl...)
Affinity DataKi:  1.52E+3nM. Assay description: In vitro binding affinity towards alpha-1A adrenergic receptor through displacement of [3H]-prazosin in epididymal rat vas deferens.
In DepthDetails ArticlePubMed