BDBM50144311 CHEMBL3760044
SMILES CCNC(=O)NCCc1coc2ccc3ccc(OC)cc3c12
InChI Key InChIKey=ACOBYGMBJMXULD-UHFFFAOYSA-N
Data  3 KI  2 EC50
  Tab Delimited (TSV)   2D SDfile   Computed 3D by Vconf -m prep SDfile
Find this compound or compounds like it in BindingDB:
Activity Spreadsheet -- Enzyme Inhibition Constant Data from BindingDB
Found 5 hits for monomerid = 50144311
TargetMelatonin receptor type 1A(Homo sapiens (Human))
Universit£
Curated by ChEMBL
LigandPNGBDBM50144311(CHEMBL3760044)
Affinity DataKi:  157nM. Assay description: Displacement of 2-[125I]iodomelatonin from human MT1 receptor expressed in CHO cell membranes after 120 mins
In DepthDetails ArticlePubMed
TargetMelatonin receptor type 1B(Homo sapiens (Human))
Universit£
Curated by ChEMBL
LigandPNGBDBM50144311(CHEMBL3760044)
Affinity DataKi:  226nM. Assay description: Displacement of 2-[125I]iodomelatonin from human MT2 receptor expressed in CHO cell membranes after 120 mins
In DepthDetails ArticlePubMed
Target5-hydroxytryptamine receptor 2C(Homo sapiens (Human))
Universit£
Curated by ChEMBL
LigandPNGBDBM50144311(CHEMBL3760044)
Affinity DataKi: >1.00E+3nM. Assay description: Binding affinity to 5-HT2C receptor (unknown origin)
In DepthDetails ArticlePubMed
TargetMelatonin receptor type 1B(Homo sapiens (Human))
Universit£
Curated by ChEMBL
LigandPNGBDBM50144311(CHEMBL3760044)
Affinity DataEC50:  6.20nM. Assay description: Intrinsic activity at human MT2 receptor expressed in CHO cell membranes after 1 hr by [35S]GTPgammaS binding assay
In DepthDetails ArticlePubMed
TargetMelatonin receptor type 1A(Homo sapiens (Human))
Universit£
Curated by ChEMBL
LigandPNGBDBM50144311(CHEMBL3760044)
Affinity DataEC50:  75nM. Assay description: Intrinsic activity at human MT1 receptor expressed in CHO cell membranes after 1 hr by [35S]GTPgammaS binding assay
In DepthDetails ArticlePubMed