BDBM50144930 2-Amino-9-((2R,3R,4R,5R)-3-fluoro-4-hydroxy-5-hydroxymethyl-tetrahydro-furan-2-yl)-1,9-dihydro-purin-6-one::CHEMBL308759
SMILES Nc1nc2n(cnc2c(=O)[nH]1)[C@@H]1O[C@H](CO)[C@@H](O)[C@H]1F
InChI Key InChIKey=UXUZARPLRQRNNX-DXTOWSMRSA-N
Data  1 EC50
PDB links: 1 PDB ID matches this monomer.
  Tab Delimited (TSV)   2D SDfile   Computed 3D by Vconf -m prep SDfile
Find this compound or compounds like it in BindingDB:
Activity Spreadsheet -- Enzyme Inhibition Constant Data from BindingDB
Found 1 hit for monomerid = 50144930
TargetRNA-directed RNA polymerase(Hepatitis C virus)
Isis Pharmaceuticals
Curated by ChEMBL
LigandPNGBDBM50144930(2-Amino-9-((2R,3R,4R,5R)-3-fluoro-4-hydroxy-5-hydr...)
Affinity DataEC50: >5.00E+4nM. Assay description: Inhibition HCV RNA replication
In DepthDetails ArticlePubMed