BDBM50149435 CHEMBL3769816
SMILES Cc1c(nc2ccc(cn12)-n1ccc(OCc2ccc(F)cc2)cc1=O)C(=O)C1CC1
InChI Key InChIKey=BXXXYZIOUUHSOK-UHFFFAOYSA-N
Data  2 IC50
  Tab Delimited (TSV)   2D SDfile   Computed 3D by Vconf -m prep SDfile
Find this compound or compounds like it in BindingDB:
Activity Spreadsheet -- Enzyme Inhibition Constant Data from BindingDB
Found 2 hits for monomerid = 50149435
TargetMelanin-concentrating hormone receptor 1(RAT)
Takeda Pharmaceutical
Curated by ChEMBL
LigandPNGBDBM50149435(CHEMBL3769816)
Affinity DataIC50: >1.00E+3nM. Assay description: Displacement of [125I]-MCH (4 to 19 residues) from rat MCHR1 expressed in CHO cell membranes after 1 hr by liquid scintillation counting analysis
In DepthDetails ArticlePubMed
TargetMelanin-concentrating hormone receptor 1(Homo sapiens (Human))
Takeda Pharmaceutical
Curated by ChEMBL
LigandPNGBDBM50149435(CHEMBL3769816)
Affinity DataIC50: >1.00E+3nM. Assay description: Displacement of [125I]-MCH (4 to19 residues) from human MCHR1 expressed in CHO cell membranes after 1 hr by liquid scintillation counting analysis
In DepthDetails ArticlePubMed