BDBM50149520 CHEMBL362224::[2,5-Dimethyl-6-(phenyl-propyl-amino)-pyrimidin-4-yl]-(2,4,6-trimethyl-phenyl)-methanone
SMILES CCCN(c1ccccc1)c1nc(C)nc(C(=O)c2c(C)cc(C)cc2C)c1C
InChI Key InChIKey=BBHFIWCFIUBFEY-UHFFFAOYSA-N
Data  1 KI
  Tab Delimited (TSV)   2D SDfile   Computed 3D by Vconf -m prep SDfile
Find this compound or compounds like it in BindingDB:
Activity Spreadsheet -- Enzyme Inhibition Constant Data from BindingDB
Found 1 hit for monomerid = 50149520
TargetCorticotropin-releasing factor receptor 1(Homo sapiens (Human))
Neurocrine Bioscience
Curated by ChEMBL
LigandPNGBDBM50149520(CHEMBL362224 | [2,5-Dimethyl-6-(phenyl-propyl-amin...)
Affinity DataKi:  180nM. Assay description: Binding affinity for recombinant human CRF1 receptor
In DepthDetails ArticlePubMed